Target
Beta-2 adrenergic receptor
Ligand
BDBM50318160
Substrate
Meas. Tech.
ChEMBL_632382 (CHEMBL1115587)
IC50
48±n/a nM
Citation
 Baur, FBeattie, DBeer, DBentley, DBradley, MBruce, ICharlton, SJCuenoud, BErnst, RFairhurst, RAFaller, BFarr, DKeller, TFozard, JRFullerton, JGarman, SHatto, JHayden, CHe, HHowes, CJanus, DJiang, ZLewis, CLoeuillet-Ritzler, FMoser, HReilly, JSteward, ASykes, DTedaldi, LTrifilieff, ATweed, MWatson, SWissler, EWyss, D The identification of indacaterol as an ultralong-acting inhaled beta2-adrenoceptor agonist. J Med Chem 53:3675-84 (2010)  
Target
Name:
Beta-2 adrenergic receptor
Synonyms:
ADRB2_CAVPO adrenergic Beta2
Type:
Enzyme Catalytic Domain
Mol. Mass.:
46993.24
Organism:
GUINEA PIG
Description:
adrenergic Beta2 ADRB2 GUINEA PIG::Q8K4Z4
Residue:
418
  
Inhibitor
Name:
BDBM50318160
Synonyms:
8-Hydroxy-5-[(R)-1-hydroxy-2-(5,6-dimethylindan-2-ylamino)-ethyl]-1H-quinolin-2-one | CHEMBL1094483
Type:
Small organic molecule
Emp. Form.:
C22H24N2O3
Mol. Mass.:
364.4376
SMILES:
Cc1cc2CC(Cc2cc1C)NC[C@H](O)c1ccc(O)c2[nH]c(=O)ccc12
: