Target
Bcl-2-like protein 1
Ligand
BDBM50318205
Substrate
Meas. Tech.
ChEMBL_628973 (CHEMBL1120823)
IC50
>100000±n/a nM
Citation
 Feng, YDing, XChen, TChen, LLiu, FJia, XLuo, XShen, XChen, KJiang, HWang, HLiu, HLiu, D Design, synthesis, and interaction study of quinazoline-2(1H)-thione derivatives as novel potential Bcl-xL inhibitors. J Med Chem 53:3465-79 (2010)  
Target
Name:
Bcl-2-like protein 1
Synonyms:
Anti-apoptotic Bcl-2 protein Apoptosis regulator Bcl-X BCL2-like 1 isoform 1 BCL2L1 Bcl-2-like protein 1 (Bcl-XL) Bcl-xL/Bcl-2-binding component 3 Bcl2-antagonist of cell death (BAD)
Type:
Mitochondrion membrane; Single-pass membrane protein
Mol. Mass.:
26039.60
Organism:
Homo sapiens (Human)
Description:
Residue:
233
  
Inhibitor
Name:
BDBM50318205
Synonyms:
(Z)-2-(3-((3-Methoxy-7-(2-methoxyphenyl)-9-oxo-5H-benzo[h]-thiazolo[2,3-b]quinazolin-10(6H,7H,9H)-ylidene)methyl)phenoxy)-acetic Acid | CHEMBL1094443
Type:
Small organic molecule
Emp. Form.:
C31H26N2O6S
Mol. Mass.:
554.613
SMILES:
COC1CC2=C(N=c3s\c(=C/c4cccc(OCC(O)=O)c4)c(=O)n3C2c2ccccc2OC)c2ccccc12
: