Target
Bcl-2-like protein 1
Ligand
BDBM50318213
Substrate
Meas. Tech.
ChEMBL_628973 (CHEMBL1120823)
IC50
1900±n/a nM
Citation
 Feng, YDing, XChen, TChen, LLiu, FJia, XLuo, XShen, XChen, KJiang, HWang, HLiu, HLiu, D Design, synthesis, and interaction study of quinazoline-2(1H)-thione derivatives as novel potential Bcl-xL inhibitors. J Med Chem 53:3465-79 (2010)  
Target
Name:
Bcl-2-like protein 1
Synonyms:
Anti-apoptotic Bcl-2 protein Apoptosis regulator Bcl-X BCL2-like 1 isoform 1 BCL2L1 Bcl-2-like protein 1 (Bcl-XL) Bcl-xL/Bcl-2-binding component 3 Bcl2-antagonist of cell death (BAD)
Type:
Mitochondrion membrane; Single-pass membrane protein
Mol. Mass.:
26039.60
Organism:
Homo sapiens (Human)
Description:
Residue:
233
  
Inhibitor
Name:
BDBM50318213
Synonyms:
(Z)-3-(5-((7-(3-Nitrophenyl)-9-oxo-5H-benzo[h]thiazolo[2,3-b]-quinazolin-10(6H,7H,9H)-ylidene)methyl)furan-2-yl)benzoic Acid | CHEMBL1095307
Type:
Small organic molecule
Emp. Form.:
C32H21N3O6S
Mol. Mass.:
575.591
SMILES:
OC(=O)c1cccc(c1)-c1ccc(\C=c2/sc3=NC4=C(CCc5ccccc45)C(c4cccc(c4)[N+]([O-])=O)n3c2=O)o1
: