Target
Cysteine protease
Ligand
BDBM50318712
Substrate
Meas. Tech.
ChEMBL_633761 (CHEMBL1119325)
Ki
80±n/a nM
Citation
 Machon, UBüchold, CStempka, MSchirmeister, TGelhaus, CLeippe, MGut, JRosenthal, PJKisker, CLeyh, MSchmuck, C On-bead screening of a combinatorial fumaric acid derived peptide library yields antiplasmodial cysteine protease inhibitors with unusual peptide sequences. J Med Chem 52:5662-72 (2009)  
Target
Name:
Cysteine protease
Synonyms:
Rhodesain
Type:
PROTEIN
Mol. Mass.:
48425.78
Organism:
Trypanosoma brucei rhodesiense
Description:
ChEMBL_619861
Residue:
450
  
Inhibitor
Name:
BDBM50318712
Synonyms:
(2S,15S,18S,21S,24S)-15-(2-amino-2-oxoethyl)-2-benzyl-24-carbamoyl-18-cyclohexyl-21-isopropyl-25-methyl-4,7,10,13,16,19,22-heptaoxo-3,6,9,14,17,20,23-heptaazahexacos-11-en-1-oic acid | CHEMBL1086432
Type:
Small organic molecule
Emp. Form.:
C39H57N9O11
Mol. Mass.:
827.9236
SMILES:
CC(C)[C@H](NC(=O)[C@@H](NC(=O)[C@@H](NC(=O)[C@H](CC(N)=O)NC(=O)\C=C\C(=O)NCC(=O)NCC(=O)N[C@@H](Cc1ccccc1)C(O)=O)C1CCCCC1)C(C)C)C(N)=O
: