Target
Cysteine protease
Ligand
BDBM50318716
Substrate
Meas. Tech.
ChEMBL_633761 (CHEMBL1119325)
Ki
1300±n/a nM
Citation
 Machon, UBüchold, CStempka, MSchirmeister, TGelhaus, CLeippe, MGut, JRosenthal, PJKisker, CLeyh, MSchmuck, C On-bead screening of a combinatorial fumaric acid derived peptide library yields antiplasmodial cysteine protease inhibitors with unusual peptide sequences. J Med Chem 52:5662-72 (2009)  
Target
Name:
Cysteine protease
Synonyms:
Rhodesain
Type:
PROTEIN
Mol. Mass.:
48425.78
Organism:
Trypanosoma brucei rhodesiense
Description:
ChEMBL_619861
Residue:
450
  
Inhibitor
Name:
BDBM50318716
Synonyms:
(2S,8S,15S,18S,21S,24S)-2-benzyl-24-carbamoyl-18,21-diisobutyl-8,15,25-trimethyl-4,7,10,13,16,19,22-heptaoxo-3,6,9,14,17,20,23-heptaazahexacos-11-en-1-oic acid | CHEMBL1086436
Type:
Small organic molecule
Emp. Form.:
C38H58N8O10
Mol. Mass.:
786.9147
SMILES:
CC(C)C[C@H](NC(=O)[C@H](C)NC(=O)\C=C\C(=O)N[C@@H](C)C(=O)NCC(=O)N[C@@H](Cc1ccccc1)C(O)=O)C(=O)N[C@@H](CC(C)C)C(=O)N[C@@H](C(C)C)C(N)=O
: