Target
Acetylcholinesterase
Ligand
BDBM9055
Substrate
Meas. Tech.
ChEMBL_633769 (CHEMBL1119333)
IC50
0.3±n/a nM
Citation
 Lv, WXue, Y Prediction of acetylcholinesterase inhibitors and characterization of correlative molecular descriptors by machine learning methods. Eur J Med Chem 45:1167-72 (2010)  
Target
Name:
Acetylcholinesterase
Synonyms:
ACES_HUMAN Acetylcholinesterase (AChE) | Acetylcholinesterase (human AChE)
Type:
Enzyme
Mol. Mass.:
67792.70
Organism:
Homo sapiens (Human)
Description:
P22303
Residue:
614
  
Inhibitor
Name:
BDBM9055
Synonyms:
6-chloro-N-{8-[(6-chloro-1,2,3,4-tetrahydroacridin-9-yl)amino]octyl}-1,2,3,4-tetrahydroacridin-9-amine Octylene-Linked Bis-(6-chloro)tacrine
Type:
Small organic molecule
Emp. Form.:
C34H40Cl2N4
Mol. Mass.:
575.614
SMILES:
Clc1ccc2c(NCCCCCCCCNc3c4CCCCc4nc4cc(Cl)ccc34)c3CCCCc3nc2c1
: