Target
Acetylcholinesterase
Ligand
BDBM9057
Substrate
Meas. Tech.
ChEMBL_633769 (CHEMBL1119333)
IC50
1.3±n/a nM
Citation
 Lv, WXue, Y Prediction of acetylcholinesterase inhibitors and characterization of correlative molecular descriptors by machine learning methods. Eur J Med Chem 45:1167-72 (2010)  
Target
Name:
Acetylcholinesterase
Synonyms:
ACES_HUMAN Acetylcholinesterase (AChE) | Acetylcholinesterase (human AChE)
Type:
Enzyme
Mol. Mass.:
67792.70
Organism:
Homo sapiens (Human)
Description:
P22303
Residue:
614
  
Inhibitor
Name:
BDBM9057
Synonyms:
Homodimeric Tacrine Analog 3k N-(7-{6H,7H,8H,9H-cyclohexa[b]1,8-naphthyridin-5-ylamino}heptyl)-6H,7H,8H,9H-cyclohexa[b]1,8-naphthyridin-5-amine
Type:
Small organic molecule
Emp. Form.:
C31H38N6
Mol. Mass.:
494.6736
SMILES:
C(CCCNc1c2CCCCc2nc2ncccc12)CCCNc1c2CCCCc2nc2ncccc12
: