Target
Acetylcholinesterase
Ligand
BDBM9027
Substrate
Meas. Tech.
ChEMBL_633769 (CHEMBL1119333)
IC50
147±n/a nM
Citation
 Lv, WXue, Y Prediction of acetylcholinesterase inhibitors and characterization of correlative molecular descriptors by machine learning methods. Eur J Med Chem 45:1167-72 (2010)  
Target
Name:
Acetylcholinesterase
Synonyms:
ACES_HUMAN Acetylcholinesterase (AChE) | Acetylcholinesterase (human AChE)
Type:
Enzyme
Mol. Mass.:
67792.70
Organism:
Homo sapiens (Human)
Description:
P22303
Residue:
614
  
Inhibitor
Name:
BDBM9027
Synonyms:
3-(1H-indol-3-yl)-N-(3-{methyl[3-(1,2,3,4-tetrahydroacridin-9-ylamino)propyl]amino}propyl)propanamide N-(3-{[3-(1,2,3,4-Tetrahydroacridin-9-ylamino)propyl]-methylamino}propyl)-3-(1H-indol-3-yl)propionamide
Type:
Small organic molecule
Emp. Form.:
C31H39N5O
Mol. Mass.:
497.6743
SMILES:
CN(CCCNC(=O)CCc1c[nH]c2ccccc12)CCCNc1c2CCCCc2nc2ccccc12
: