Target
Acetylcholinesterase
Ligand
BDBM9037
Substrate
Meas. Tech.
ChEMBL_633769 (CHEMBL1119333)
IC50
0.3±n/a nM
Citation
 Lv, WXue, Y Prediction of acetylcholinesterase inhibitors and characterization of correlative molecular descriptors by machine learning methods. Eur J Med Chem 45:1167-72 (2010)  
Target
Name:
Acetylcholinesterase
Synonyms:
ACES_HUMAN Acetylcholinesterase (AChE) | Acetylcholinesterase (human AChE)
Type:
Enzyme
Mol. Mass.:
67792.70
Organism:
Homo sapiens (Human)
Description:
P22303
Residue:
614
  
Inhibitor
Name:
BDBM9037
Synonyms:
Indole-Tacrine Heterodimer 20 N-{5-[(6-chloro-1,2,3,4-tetrahydroacridin-9-yl)amino]pentyl}-4-(1H-indol-3-yl)butanamide
Type:
Small organic molecule
Emp. Form.:
C30H35ClN4O
Mol. Mass.:
503.078
SMILES:
Clc1ccc2c(NCCCCCNC(=O)CCCc3c[nH]c4ccccc34)c3CCCCc3nc2c1
: