Target
Acetylcholinesterase
Ligand
BDBM50318733
Substrate
Meas. Tech.
ChEMBL_633769 (CHEMBL1119333)
IC50
1.5±n/a nM
Citation
 Lv, WXue, Y Prediction of acetylcholinesterase inhibitors and characterization of correlative molecular descriptors by machine learning methods. Eur J Med Chem 45:1167-72 (2010)  
Target
Name:
Acetylcholinesterase
Synonyms:
ACES_HUMAN Acetylcholinesterase (AChE) | Acetylcholinesterase (human AChE)
Type:
Enzyme
Mol. Mass.:
67792.70
Organism:
Homo sapiens (Human)
Description:
P22303
Residue:
614
  
Inhibitor
Name:
BDBM50318733
Synonyms:
3-(2-(1H-indol-3-yl)ethoxy)-N-(5-(6-chloro-1,2,3,4-tetrahydroacridin-9-ylamino)pentyl)propanamide | CHEMBL1086007
Type:
Small organic molecule
Emp. Form.:
C31H37ClN4O2
Mol. Mass.:
533.104
SMILES:
Clc1ccc2c(NCCCCCNC(=O)CCOCCc3c[nH]c4ccccc34)c3CCCCc3nc2c1
: