Target
Acetylcholinesterase
Ligand
BDBM31904
Substrate
Meas. Tech.
ChEMBL_633769 (CHEMBL1119333)
IC50
7140±n/a nM
Citation
 Lv, WXue, Y Prediction of acetylcholinesterase inhibitors and characterization of correlative molecular descriptors by machine learning methods. Eur J Med Chem 45:1167-72 (2010)  
Target
Name:
Acetylcholinesterase
Synonyms:
ACES_HUMAN Acetylcholinesterase (AChE) | Acetylcholinesterase (human AChE)
Type:
Enzyme
Mol. Mass.:
67792.70
Organism:
Homo sapiens (Human)
Description:
P22303
Residue:
614
  
Inhibitor
Name:
BDBM31904
Synonyms:
CHEMBL345124 Propidium Iodide, 2 | propidium iodide
Type:
Small organic molecule
Emp. Form.:
C27H34N4
Mol. Mass.:
414.5846
SMILES:
CC[N+](C)(CC)CCCn1c(-c2ccccc2)c2cc(N)ccc2c2ccc(=[NH2+])cc12
: