Target
Acetylcholinesterase
Ligand
BDBM50032164
Substrate
Meas. Tech.
ChEMBL_633769 (CHEMBL1119333)
IC50
0.57±n/a nM
Citation
 Lv, WXue, Y Prediction of acetylcholinesterase inhibitors and characterization of correlative molecular descriptors by machine learning methods. Eur J Med Chem 45:1167-72 (2010)  
Target
Name:
Acetylcholinesterase
Synonyms:
ACES_HUMAN Acetylcholinesterase (AChE) | Acetylcholinesterase (human AChE)
Type:
Enzyme
Mol. Mass.:
67792.70
Organism:
Homo sapiens (Human)
Description:
P22303
Residue:
614
  
Inhibitor
Name:
BDBM50032164
Synonyms:
3-(2-(1-benzylpiperidin-4-yl)ethyl)-5,6-dihydroisoxazolo[4,5-g]quinolin-7(8H)-one CHEMBL329231
Type:
Small organic molecule
Emp. Form.:
C24H27N3O2
Mol. Mass.:
389.4901
SMILES:
O=C1CCc2cc3c(CCC4CCN(Cc5ccccc5)CC4)noc3cc2N1
: