Target
Extracellular calcium-sensing receptor
Ligand
BDBM50318876
Substrate
Meas. Tech.
ChEMBL_633356 (CHEMBL1120576)
IC50
73±n/a nM
Citation
 Allen, JGFotsch, CBabij, P Emerging targets in osteoporosis disease modification. J Med Chem 53:4332-53 (2010)  
Target
Name:
Extracellular calcium-sensing receptor
Synonyms:
CASR CaR Calcium-sensing receptor (CaSR) GPRC2A Parathyroid Cell calcium-sensing receptor Synonyms=GPRC2A | hCasR
Type:
Protein
Mol. Mass.:
120663.13
Organism:
Homo sapiens (Human)
Description:
P41180
Residue:
1078
  
Inhibitor
Name:
BDBM50318876
Synonyms:
(R)-3-(4-cyano-3-(3-(1-(2,3-dihydro-1H-inden-2-yl)-2-methylpropan-2-ylamino)-2-hydroxypropoxy)phenyl)propanoic acid | CHEMBL1084513
Type:
Small organic molecule
Emp. Form.:
C26H32N2O4
Mol. Mass.:
436.5433
SMILES:
CC(C)(CC1Cc2ccccc2C1)NC[C@@H](O)COc1cc(CCC(O)=O)ccc1C#N
: