Target
Integrin alpha-V/beta-3
Ligand
BDBM50177628
Substrate
Meas. Tech.
ChEMBL_633353 (CHEMBL1120573)
IC50
0.4±n/a nM
Citation
 Allen, JGFotsch, CBabij, P Emerging targets in osteoporosis disease modification. J Med Chem 53:4332-53 (2010)  
Target
Name:
Integrin alpha-V/beta-3
Synonyms:
ITGAV/ITGB3 | Integrin beta-3/Vitronectin receptor alpha
Type:
Enzyme
Mol. Mass.:
Description:
Components:
This complex has 2 components.
Component 1
Name:
Integrin alpha-V
Synonyms:
ITAV_HUMAN Integrin alpha-V/alpha-5 VNRA Vitronectin receptor | Vitronectin receptor subunit alpha
Type:
PROTEIN
Mol. Mass.:
116024.92
Organism:
Homo sapiens (Human)
Description:
ChEMBL_582336
Residue:
1048
  
Component 2
Name:
Integrin beta-3
Synonyms:
CD_antigen=CD61 GPIIIa ITGB3 Platelet membrane glycoprotein IIIa
Type:
Protein
Mol. Mass.:
87038.91
Organism:
Homo sapiens (Human)
Description:
P05106
Residue:
788
  
Inhibitor
Name:
BDBM50177628
Synonyms:
(S)-3-(benzo[d][1,3]dioxol-5-yl)-4-(3-(3-(5,6,7,8-tetrahydro-1,8-naphthyridin-2-yl)propyl)-1,2,4-oxadiazol-5-yl)butanoic acid | CHEMBL369981
Type:
Small organic molecule
Emp. Form.:
C24H26N4O5
Mol. Mass.:
450.487
SMILES:
OC(=O)C[C@H](Cc1nc(CCCc2ccc3CCCNc3n2)no1)c1ccc2OCOc2c1
: