Target
Progesterone receptor
Ligand
BDBM50318939
Substrate
Meas. Tech.
ChEMBL_635285 (CHEMBL1118389)
IC50
35±n/a nM
Citation
 Dack, KNSkerratt, SJohnson, PSBradley, PAMarsh, IR Optimisation of a pyrazole series of progesterone antagonists; Part 1. Bioorg Med Chem Lett 20:3384-6 (2010)  
Target
Name:
Progesterone receptor
Synonyms:
NR3C3 PGR PRGR_HUMAN | progesterone
Type:
Protein
Mol. Mass.:
98979.52
Organism:
Homo sapiens (Human)
Description:
P06401
Residue:
933
  
Inhibitor
Name:
BDBM50318939
Synonyms:
2-(3-(4-cyanophenoxy)-2,4-diethyl-1H-pyrrol-1-yl)-N-methylacetamide | CHEMBL1083359
Type:
Small organic molecule
Emp. Form.:
C18H21N3O2
Mol. Mass.:
311.3782
SMILES:
CCc1cn(CC(=O)NC)c(CC)c1Oc1ccc(cc1)C#N
: