Target
Progesterone receptor
Ligand
BDBM50318942
Substrate
Meas. Tech.
ChEMBL_635285 (CHEMBL1118389)
IC50
13±n/a nM
Citation
 Dack, KNSkerratt, SJohnson, PSBradley, PAMarsh, IR Optimisation of a pyrazole series of progesterone antagonists; Part 1. Bioorg Med Chem Lett 20:3384-6 (2010)  
Target
Name:
Progesterone receptor
Synonyms:
NR3C3 PGR PRGR_HUMAN | progesterone
Type:
Protein
Mol. Mass.:
98979.52
Organism:
Homo sapiens (Human)
Description:
P06401
Residue:
933
  
Inhibitor
Name:
BDBM50318942
Synonyms:
4-(2,4-diethyl-1-(2-methoxyethyl)-1H-pyrrol-3-yloxy)benzonitrile | CHEMBL1085008
Type:
Small organic molecule
Emp. Form.:
C18H22N2O2
Mol. Mass.:
298.3795
SMILES:
CCc1cn(CCOC)c(CC)c1Oc1ccc(cc1)C#N
: