Target
Beta-2 adrenergic receptor
Ligand
BDBM50318986
Substrate
Meas. Tech.
ChEMBL_635468 (CHEMBL1120618)
Ki
0.200000±n/a nM
Citation
 Tasler, SBaumgartner, RAschenbrenner, AAmmendola, AWolf, KWieber, TSchachtner, JBlisse, MQuotschalla, UNey, P A vHTS approach for the identification of beta-adrenoceptor ligands. Bioorg Med Chem Lett 20:3399-404 (2010)  
Target
Name:
Beta-2 adrenergic receptor
Synonyms:
ADRB2 ADRB2_HUMAN Beta-2 adrenoceptor | Beta-2 adrenoreceptor
Type:
Mol. Mass.:
46461.69
Organism:
Homo sapiens (Human)
Description:
P07550
Residue:
413
  
Inhibitor
Name:
BDBM50318986
Synonyms:
1-(9H-carbazol-4-yloxy)-3-(4-(4-methoxybenzyl)piperidin-1-yl)propan-2-ol | CHEMBL1082500
Type:
Small organic molecule
Emp. Form.:
C28H32N2O3
Mol. Mass.:
444.5653
SMILES:
COc1ccc(CC2CCN(CC(O)COc3cccc4[nH]c5ccccc5c34)CC2)cc1
: