Target
Rho-associated protein kinase 1
Ligand
BDBM50319022
Substrate
Meas. Tech.
ChEMBL_635489 (CHEMBL1117723)
EC50
>10000±n/a nM
Citation
 Davis, RLKahraman, MPrins, TJBeaver, YCook, TGCramp, JCayanan, CSGardiner, EMMcLaughlin, MAClark, AFHellberg, MRShiau, AKNoble, SABorchardt, AJ Benzothiophene containing Rho kinase inhibitors: Efficacy in an animal model of glaucoma. Bioorg Med Chem Lett 20:3361-6 (2010)  
Target
Name:
Rho-associated protein kinase 1
Synonyms:
ROCK-I ROCK1_HUMAN Rho-associated protein kinase Rho-associated, coiled-coil-containing protein kinase 1 Rho-kinase (ROCK I) p160 ROCK-1 | p160ROCK
Type:
Serine/threonine-protein kinase
Mol. Mass.:
158156.77
Organism:
Homo sapiens (Human)
Description:
Q13464
Residue:
1354
  
Inhibitor
Name:
BDBM50319022
Synonyms:
3-((2-(2-aminopyrimidin-4-yl)-3-methylbenzo[b]thiophen-5-yl)methyl)benzoic acid | CHEMBL1084791
Type:
Small organic molecule
Emp. Form.:
C21H17N3O2S
Mol. Mass.:
375.444
SMILES:
Cc1c(sc2ccc(Cc3cccc(c3)C(O)=O)cc12)-c1ccnc(N)n1
: