Target
P2Y purinoceptor 2
Ligand
BDBM50319143
Substrate
Meas. Tech.
ChEMBL_635658 (CHEMBL1119550)
EC50
50±n/a nM
Citation
 Maruoka, HBarrett, MOKo, HTosh, DKMelman, ABurianek, LEBalasubramanian, RBerk, BCostanzi, SHarden, TKJacobson, KA Pyrimidine ribonucleotides with enhanced selectivity as P2Y(6) receptor agonists: novel 4-alkyloxyimino, (S)-methanocarba, and 5'-triphosphate gamma-ester modifications. J Med Chem 53:4488-501 (2010)  
Target
Name:
P2Y purinoceptor 2
Synonyms:
ATP receptor P2RY2 P2U purinoceptor 1 P2Y purinoceptor 2 Purinergic receptor | Purinergic receptor P2Y2
Type:
PROTEIN
Mol. Mass.:
42299.21
Organism:
Homo sapiens (Human)
Description:
ChEMBL_1455361
Residue:
377
  
Inhibitor
Name:
BDBM50319143
Synonyms:
CHEMBL1083764 N4-Methoxycytidine 5'-Triphosphate triethylammonium Salt
Type:
Small organic molecule
Emp. Form.:
C10H18N3O15P3
Mol. Mass.:
513.1823
SMILES:
CONc1ccn([C@@H]2O[C@H](COP(O)(=O)OP(O)(=O)OP(O)(O)=O)[C@@H](O)[C@H]2O)c(=O)n1
: