Target
Histamine H4 receptor
Ligand
BDBM50319282
Substrate
Meas. Tech.
ChEMBL_634016 (CHEMBL1117989)
Ki
2000±n/a nM
Citation
 Savall, BMEdwards, JPVenable, JDBuzard, DJThurmond, RHack, MMcGovern, P Agonist/antagonist modulation in a series of 2-aryl benzimidazole H4 receptor ligands. Bioorg Med Chem Lett 20:3367-71 (2010)  
Target
Name:
Histamine H4 receptor
Synonyms:
AXOR35 GPCR105 HH4R HRH4 Histamine H4 receptor Histamine receptor (H3 and H4) SP9144
Type:
G Protein-Coupled Receptor (GPCR)
Mol. Mass.:
44517.02
Organism:
Homo sapiens (Human)
Description:
Binding assays were using CHO cells stably expressing hH4R receptors.
Residue:
390
  
Inhibitor
Name:
BDBM50319282
Synonyms:
1-(3-(4-(5-fluoro-4-methyl-1H-benzo[d]imidazol-2-yl)-3-methylphenoxy)propyl)-N,N-dimethylpiperidin-3-amine | CHEMBL1084809
Type:
Small organic molecule
Emp. Form.:
C25H33FN4O
Mol. Mass.:
424.5541
SMILES:
CN(C)C1CCCN(CCCOc2ccc(-c3nc4ccc(F)c(C)c4[nH]3)c(C)c2)C1
: