Target
Histamine H4 receptor
Ligand
BDBM50319289
Substrate
Meas. Tech.
ChEMBL_634016 (CHEMBL1117989)
Ki
>10000±n/a nM
Citation
 Savall, BMEdwards, JPVenable, JDBuzard, DJThurmond, RHack, MMcGovern, P Agonist/antagonist modulation in a series of 2-aryl benzimidazole H4 receptor ligands. Bioorg Med Chem Lett 20:3367-71 (2010)  
Target
Name:
Histamine H4 receptor
Synonyms:
AXOR35 GPCR105 HH4R HRH4 Histamine H4 receptor Histamine receptor (H3 and H4) SP9144
Type:
G Protein-Coupled Receptor (GPCR)
Mol. Mass.:
44517.02
Organism:
Homo sapiens (Human)
Description:
Binding assays were using CHO cells stably expressing hH4R receptors.
Residue:
390
  
Inhibitor
Name:
BDBM50319289
Synonyms:
(+/-)-2-(4-(3-(3,6-diazabicyclo[3.1.0]hexan-3-yl)propoxy)-2-methylphenyl)-5-fluoro-4-methyl-1H-benzo[d]imidazole | CHEMBL1083099
Type:
Small organic molecule
Emp. Form.:
C22H25FN4O
Mol. Mass.:
380.4585
SMILES:
Cc1cc(OCCCN2CC3NC3C2)ccc1-c1nc2ccc(F)c(C)c2[nH]1
: