Target
C-C chemokine receptor type 5
Ligand
BDBM50319434
Substrate
Meas. Tech.
ChEMBL_634191 (CHEMBL1119773)
IC50
6±n/a nM
Citation
 Rotstein, DMGabriel, SDManser, NFilonova, LPadilla, FSankuratri, SJi, CdeRosier, ADioszegi, MHeilek, GJekle, AWeller, PBerry, P Synthesis, SAR and evaluation of [1,4']-bipiperidinyl-4-yl-imidazolidin-2-one derivatives as novel CCR5 antagonists. Bioorg Med Chem Lett 20:3219-22 (2010)  
Target
Name:
C-C chemokine receptor type 5
Synonyms:
C-C CKR-5 CC-CKR-5 CCR5 CCR5_HUMAN CHEMR13 HIV-1 fusion coreceptor
Type:
Enzyme
Mol. Mass.:
40540.21
Organism:
Homo sapiens (Human)
Description:
P51681
Residue:
352
  
Inhibitor
Name:
BDBM50319434
Synonyms:
(R)-3-(1'-(4,6-dimethylpyrimidine-5-carbonyl)-4'-methyl-1,4'-bipiperidin-4-yl)-1-((trans-4-ethoxycyclohexyl)methyl)-4-phenylimidazolidin-2-one | CHEMBL1085223
Type:
Small organic molecule
Emp. Form.:
C36H52N6O3
Mol. Mass.:
616.8365
SMILES:
CCO[C@H]1CC[C@H](CN2C[C@H](N(C3CCN(CC3)C3(C)CCN(CC3)C(=O)c3c(C)ncnc3C)C2=O)c2ccccc2)CC1
: