Target
Histamine H3 receptor
Ligand
BDBM50319540
Substrate
Meas. Tech.
ChEMBL_634305 (CHEMBL1120718)
Ki
4.5±n/a nM
Citation
 Liu, HAltenbach, RJDiaz, GJManelli, AMMartin, RLMiller, TREsbenshade, TABrioni, JDCowart, MD In vitro studies on a class of quinoline containing histamine H3 antagonists. Bioorg Med Chem Lett 20:3295-300 (2010)  
Target
Name:
Histamine H3 receptor
Synonyms:
HH3R Hrh3
Type:
G Protein-Coupled Receptor (GPCR)
Mol. Mass.:
48607.98
Organism:
Rattus norvegicus (rat)
Description:
Residue:
445
  
Inhibitor
Name:
BDBM50319540
Synonyms:
(R)-4-methyl-5-(6-(2-(2-methylpyrrolidin-1-yl)ethyl)quinolin-2-yl)-2-(thiophen-2-yl)thiazole | CHEMBL1086292
Type:
Small organic molecule
Emp. Form.:
C24H25N3S2
Mol. Mass.:
419.605
SMILES:
C[C@@H]1CCCN1CCc1ccc2nc(ccc2c1)-c1sc(nc1C)-c1cccs1
: