Target
Potassium voltage-gated channel subfamily H member 2
Ligand
BDBM50319566
Substrate
Meas. Tech.
ChEMBL_634306 (CHEMBL1120719)
Ki
4500±n/a nM
Citation
 Liu, HAltenbach, RJDiaz, GJManelli, AMMartin, RLMiller, TREsbenshade, TABrioni, JDCowart, MD In vitro studies on a class of quinoline containing histamine H3 antagonists. Bioorg Med Chem Lett 20:3295-300 (2010)  
Target
Name:
Potassium voltage-gated channel subfamily H member 2
Synonyms:
1,3-beta-glucan synthase component GLS2 ERG Eag-related protein 1 Ether-a-go-go-related gene (HERG) Ether-a-go-go-related gene potassium channel 1 Ether-a-go-go-related gene potassium channel 1 (hERG1) Ether-a-go-go-related protein 1 H-ERG KCNH2 Potassium voltage-gated channel subfamily H member 2 (hERG) Voltage-gated potassium channel subunit Kv11.1 hERG Potassium Channel 1 | putative potassium channel subunit
Type:
Multi-pass membrane protein
Mol. Mass.:
126672.65
Organism:
Homo sapiens (Human)
Description:
Q12809
Residue:
1159
  
Inhibitor
Name:
BDBM50319566
Synonyms:
(R)-N,N-dimethyl-6-(5-methyl-4-(6-(2-(2-methylpyrrolidin-1-yl)ethyl)quinolin-2-yl)-1H-pyrazol-1-yl)pyridazin-3-amine | CHEMBL1083462
Type:
Small organic molecule
Emp. Form.:
C26H31N7
Mol. Mass.:
441.5712
SMILES:
C[C@@H]1CCCN1CCc1ccc2nc(ccc2c1)-c1cnn(c1C)-c1ccc(nn1)N(C)C
: