Target
Histamine H3 receptor
Ligand
BDBM50319513
Substrate
Meas. Tech.
ChEMBL_634305 (CHEMBL1120718)
Ki
2.2±n/a nM
Citation
 Liu, HAltenbach, RJDiaz, GJManelli, AMMartin, RLMiller, TREsbenshade, TABrioni, JDCowart, MD In vitro studies on a class of quinoline containing histamine H3 antagonists. Bioorg Med Chem Lett 20:3295-300 (2010)  
Target
Name:
Histamine H3 receptor
Synonyms:
HH3R Hrh3
Type:
G Protein-Coupled Receptor (GPCR)
Mol. Mass.:
48607.98
Organism:
Rattus norvegicus (rat)
Description:
Residue:
445
  
Inhibitor
Name:
BDBM50319513
Synonyms:
(R)-2-(2,6-dimethylpyridin-3-yl)-6-(2-(2-methylpyrrolidin-1-yl)ethyl)quinoline | CHEMBL1082447
Type:
Small organic molecule
Emp. Form.:
C23H27N3
Mol. Mass.:
345.4806
SMILES:
C[C@@H]1CCCN1CCc1ccc2nc(ccc2c1)-c1ccc(C)nc1C
: