Target
Sodium-dependent noradrenaline transporter
Ligand
BDBM50319600
Substrate
Meas. Tech.
ChEMBL_634327 (CHEMBL1120740)
IC50
94±n/a nM
Citation
 O'Neill, DJAdedoyin, AAlfinito, PDBray, JACosmi, SDeecher, DCFensome, AHarrison, JLeventhal, LMann, CMcComas, CCSullivan, NRSpangler, TBUveges, AJTrybulski, EJWhiteside, GTZhang, P Discovery of novel selective norepinephrine reuptake inhibitors: 4-[3-aryl-2,2-dioxido-2,1,3-benzothiadiazol-1(3H)-yl]-1-(methylamino)butan-2-ols (WYE-103231). J Med Chem 53:4511-21 (2010)  
Target
Name:
Sodium-dependent noradrenaline transporter
Synonyms:
Monoamine transporter NET Noradrenaline Transporter (NET) Norepinephrine transporter protein (NET) SLC6A2 Sodium-dependent noradrenaline transporter (NET) | Solute carrier family 6 member 2
Type:
Multi-pass membrane protein
Mol. Mass.:
69337.72
Organism:
Homo sapiens (Human)
Description:
P23975
Residue:
617
  
Inhibitor
Name:
BDBM50319600
Synonyms:
2,2-Difluoro-3-[3-(2-fluorophenyl)-2,2-dioxido-2,1,3-benzothiadiazol-1(3H)-yl]-N-methylpropan-1-amine | CHEMBL1085830
Type:
Small organic molecule
Emp. Form.:
C16H16F3N3O2S
Mol. Mass.:
371.377
SMILES:
CNCC(F)(F)CN1c2ccccc2N(c2ccccc2F)S1(=O)=O
: