Target
Cyclin-dependent kinase 1
Ligand
BDBM50319626
Substrate
Meas. Tech.
ChEMBL_634454 (CHEMBL1119480)
Ki
>10000±n/a nM
Citation
 Wang, SMidgley, CAScaërou, FGrabarek, JBGriffiths, GJackson, WKontopidis, GMcClue, SJMcInnes, CMeades, CMezna, MPlater, AStuart, IThomas, MPWood, GClarke, RGBlake, DGZheleva, DILane, DPJackson, RCGlover, DMFischer, PM Discovery of N-phenyl-4-(thiazol-5-yl)pyrimidin-2-amine aurora kinase inhibitors. J Med Chem 53:4367-78 (2010)  
Target
Name:
Cyclin-dependent kinase 1
Synonyms:
CDC2 CDK1 CDKN1 Cell division protein kinase 1 P34CDC2 | p34 protein kinase
Type:
Enzyme Subunit
Mol. Mass.:
34101.08
Organism:
Homo sapiens (Human)
Description:
P06493
Residue:
297
  
Inhibitor
Name:
BDBM50319626
Synonyms:
4-(2,4-Dimethylthiazol-5-yl)-N-(4-(4-(methylsulfonyl)piperazin-1-yl)phenyl)pyrimidin-2-amine | CHEMBL1083484
Type:
Small organic molecule
Emp. Form.:
C20H24N6O2S2
Mol. Mass.:
444.574
SMILES:
Cc1nc(C)c(s1)-c1ccnc(Nc2ccc(cc2)N2CCN(CC2)S(C)(=O)=O)n1
: