Target
Cyclin-dependent kinase 1
Ligand
BDBM50319627
Substrate
Meas. Tech.
ChEMBL_634454 (CHEMBL1119480)
Ki
1894±n/a nM
Citation
 Wang, SMidgley, CAScaërou, FGrabarek, JBGriffiths, GJackson, WKontopidis, GMcClue, SJMcInnes, CMeades, CMezna, MPlater, AStuart, IThomas, MPWood, GClarke, RGBlake, DGZheleva, DILane, DPJackson, RCGlover, DMFischer, PM Discovery of N-phenyl-4-(thiazol-5-yl)pyrimidin-2-amine aurora kinase inhibitors. J Med Chem 53:4367-78 (2010)  
Target
Name:
Cyclin-dependent kinase 1
Synonyms:
CDC2 CDK1 CDKN1 Cell division protein kinase 1 P34CDC2 | p34 protein kinase
Type:
Enzyme Subunit
Mol. Mass.:
34101.08
Organism:
Homo sapiens (Human)
Description:
P06493
Residue:
297
  
Inhibitor
Name:
BDBM50319627
Synonyms:
1-(4-(4-(4-(2,4-Dimethylthiazol-5-yl)pyrimidin-2-ylamino)phenyl)piperazin-1-yl)ethanone | CHEMBL1083786
Type:
Small organic molecule
Emp. Form.:
C21H24N6OS
Mol. Mass.:
408.52
SMILES:
CC(=O)N1CCN(CC1)c1ccc(Nc2nccc(n2)-c2sc(C)nc2C)cc1
: