Target
RAC-alpha serine/threonine-protein kinase
Ligand
BDBM50277583
Substrate
Meas. Tech.
ChEMBL_634482 (CHEMBL1119890)
Ki
>10000±n/a nM
Citation
 Wang, SMidgley, CAScaërou, FGrabarek, JBGriffiths, GJackson, WKontopidis, GMcClue, SJMcInnes, CMeades, CMezna, MPlater, AStuart, IThomas, MPWood, GClarke, RGBlake, DGZheleva, DILane, DPJackson, RCGlover, DMFischer, PM Discovery of N-phenyl-4-(thiazol-5-yl)pyrimidin-2-amine aurora kinase inhibitors. J Med Chem 53:4367-78 (2010)  
Target
Name:
RAC-alpha serine/threonine-protein kinase
Synonyms:
AKT phosphorylation (p-AKT) AKT1/PPP1CA C-AKT PKB alpha Protein kinase B Protein kinase B (Akt 1) Protein kinase B alpha Proto-oncogene Akt (Akt1) Proto-oncogene c-Akt (AKT1) RAC-PK-alpha RAC-alpha serine/threonine-protein kinase (AKT1) | RAC-alpha serine/threonine-protein kinase (pAKT)
Type:
Enzyme
Mol. Mass.:
55681.25
Organism:
Homo sapiens (Human)
Description:
P31749
Residue:
480
  
Inhibitor
Name:
BDBM50277583
Synonyms:
2-amino-4-methyl-1,3-thiazol-5-yl)-N-[4-(morpholin-4-yl)phenyl]pyrimidin-2-amine, 5 Aminopyrimidine, 9 CYC-116
Type:
Small organic molecule
Emp. Form.:
C18H20N6OS
Mol. Mass.:
368.456
SMILES:
Cc1nc(N)sc1-c1ccnc(Nc2ccc(cc2)N2CCOCC2)n1
: