Target
Cyclin-dependent kinase 9
Ligand
BDBM50319625
Substrate
Meas. Tech.
ChEMBL_634458 (CHEMBL1119484)
Ki
348±n/a nM
Citation
 Wang, SMidgley, CAScaërou, FGrabarek, JBGriffiths, GJackson, WKontopidis, GMcClue, SJMcInnes, CMeades, CMezna, MPlater, AStuart, IThomas, MPWood, GClarke, RGBlake, DGZheleva, DILane, DPJackson, RCGlover, DMFischer, PM Discovery of N-phenyl-4-(thiazol-5-yl)pyrimidin-2-amine aurora kinase inhibitors. J Med Chem 53:4367-78 (2010)  
Target
Name:
Cyclin-dependent kinase 9
Synonyms:
C-2K CDK9 Cell division cycle 2-like protein kinase 4 Cyclin-Dependent Kinase 9 (CDK9) Serine/threonine-protein kinase PITALRE Tat-associated kinase complex catalytic subunit
Type:
Enzyme Subunit
Mol. Mass.:
42789.13
Organism:
Homo sapiens (Human)
Description:
Residue:
372
  
Inhibitor
Name:
BDBM50319625
Synonyms:
CHEMBL1083150 | N1-(4-(2,4-Dimethylthiazol-5-yl)pyrimidin-2-yl)-N4-methylbenzene-1,4-diamine
Type:
Small organic molecule
Emp. Form.:
C16H17N5S
Mol. Mass.:
311.405
SMILES:
CNc1ccc(Nc2nccc(n2)-c2sc(C)nc2C)cc1
: