Target
Cyclin-dependent kinase 7
Ligand
BDBM50319623
Substrate
Meas. Tech.
ChEMBL_634457 (CHEMBL1119483)
Ki
243±n/a nM
Citation
 Wang, SMidgley, CAScaërou, FGrabarek, JBGriffiths, GJackson, WKontopidis, GMcClue, SJMcInnes, CMeades, CMezna, MPlater, AStuart, IThomas, MPWood, GClarke, RGBlake, DGZheleva, DILane, DPJackson, RCGlover, DMFischer, PM Discovery of N-phenyl-4-(thiazol-5-yl)pyrimidin-2-amine aurora kinase inhibitors. J Med Chem 53:4367-78 (2010)  
Target
Name:
Cyclin-dependent kinase 7
Synonyms:
39 kDa protein kinase CAK1 CDK-activating kinase 1 (CAK) CDK7_HUMAN Cell division protein kinase 7 Cyclin-dependent kinase 7 (CDK7/cyclin H) P39 Mo15 TFIIH basal transcription factor complex kinase subunit
Type:
Enzyme Subunit
Mol. Mass.:
39047.01
Organism:
Homo sapiens (Human)
Description:
Residue:
346
  
Inhibitor
Name:
BDBM50319623
Synonyms:
4-(2,4-Dimethylthiazol-5-yl)-N-(3,4,5-trimethoxyphenyl)pyrimidin-2-amine | CHEMBL1083151
Type:
Small organic molecule
Emp. Form.:
C18H20N4O3S
Mol. Mass.:
372.441
SMILES:
COc1cc(Nc2nccc(n2)-c2sc(C)nc2C)cc(OC)c1OC
: