Target
Cyclin-dependent kinase 4
Ligand
BDBM8066
Substrate
Meas. Tech.
ChEMBL_634456 (CHEMBL1119482)
Ki
1503±n/a nM
Citation
 Wang, SMidgley, CAScaërou, FGrabarek, JBGriffiths, GJackson, WKontopidis, GMcClue, SJMcInnes, CMeades, CMezna, MPlater, AStuart, IThomas, MPWood, GClarke, RGBlake, DGZheleva, DILane, DPJackson, RCGlover, DMFischer, PM Discovery of N-phenyl-4-(thiazol-5-yl)pyrimidin-2-amine aurora kinase inhibitors. J Med Chem 53:4367-78 (2010)  
Target
Name:
Cyclin-dependent kinase 4
Synonyms:
CDK4 Cell division protein kinase 4 PSK-J3
Type:
Enzyme Subunit
Mol. Mass.:
33731.96
Organism:
Homo sapiens (Human)
Description:
P11802
Residue:
303
  
Inhibitor
Name:
BDBM8066
Synonyms:
2-Anilino-4-(thiazol-5-yl)pyrimidine deriv. 37 4-N-[4-(2,4-dimethyl-1,3-thiazol-5-yl)pyrimidin-2-yl]-1-N,1-N-dimethylbenzene-1,4-diamine | N-[4-(2,4-Dimethylthiazol-5-yl)pyrimidin-2-yl]N,N-dimethylbenzene-1,4-diamine
Type:
Small organic molecule
Emp. Form.:
C17H19N5S
Mol. Mass.:
325.431
SMILES:
CN(C)c1ccc(Nc2nccc(n2)-c2sc(C)nc2C)cc1
: