Target
Prostaglandin D2 receptor
Ligand
BDBM50319845
Substrate
Meas. Tech.
ChEMBL_634906 (CHEMBL1120633)
Ki
14±n/a nM
Citation
 Colucci, JBoyd, MBerthelette, CChiasson, JFWang, ZDucharme, YFriesen, RWrona, MLevesque, JFDenis, DMathieu, MCStocco, RTherien, AGClarke, PRowland, SXu, DHan, Y Discovery of 4-[1-[([1-[4-(trifluoromethyl)benzyl]-1H-indol-7-yl]carbonyl)amino]cyclopropyl]benzoic acid (MF-766), a highly potent and selective EP4 antagonist for treating inflammatory pain. Bioorg Med Chem Lett 20:3760-3 (2010)  
Target
Name:
Prostaglandin D2 receptor
Synonyms:
PD2R_HUMAN Prostaglandin D2 Prostanoid DP receptor
Type:
Enzyme
Mol. Mass.:
40288.87
Organism:
Homo sapiens (Human)
Description:
Q13258
Residue:
359
  
Inhibitor
Name:
BDBM50319845
Synonyms:
(S)-4-(1-(3-chloro-1-(3-chlorobenzyl)-1H-indole-7-carboxamido)ethyl)benzoic acid | CHEMBL1083445
Type:
Small organic molecule
Emp. Form.:
C25H20Cl2N2O3
Mol. Mass.:
467.344
SMILES:
C[C@H](NC(=O)c1cccc2c(Cl)cn(Cc3cccc(Cl)c3)c12)c1ccc(cc1)C(O)=O
: