Target
Cathepsin S
Ligand
BDBM50320052
Substrate
Meas. Tech.
ChEMBL_635108 (CHEMBL1119418)
IC50
6.2±n/a nM
Citation
 Chen, JCUang, BJLyu, PCChang, JYLiu, KJKuo, CCHsieh, HPWang, HCCheng, CSChang, YHChang, MDChang, WSLin, CC Design and synthesis of alpha-ketoamides as cathepsin S inhibitors with potential applications against tumor invasion and angiogenesis. J Med Chem 53:4545-9 (2010)  
Target
Name:
Cathepsin S
Synonyms:
CATS_HUMAN Cathepsin S (Cat S) | cathepsin S preproprotein
Type:
Protein
Mol. Mass.:
37507.38
Organism:
Homo sapiens (Human)
Description:
P25774
Residue:
331
  
Inhibitor
Name:
BDBM50320052
Synonyms:
CHEMBL1085975 | ethyl 2-(4-(benzyloxy)-3-((S)-3-cyclohexyl-2-(4-methylbenzamido)propanamido)-2-oxobutanamido)acetate
Type:
Small organic molecule
Emp. Form.:
C32H41N3O7
Mol. Mass.:
579.6838
SMILES:
CCOC(=O)CNC(=O)C(=O)C(COCc1ccccc1)NC(=O)[C@H](CC1CCCCC1)NC(=O)c1ccc(C)cc1
: