Target
Cathepsin S
Ligand
BDBM50320065
Substrate
Meas. Tech.
ChEMBL_635108 (CHEMBL1119418)
IC50
2.1±n/a nM
Citation
 Chen, JCUang, BJLyu, PCChang, JYLiu, KJKuo, CCHsieh, HPWang, HCCheng, CSChang, YHChang, MDChang, WSLin, CC Design and synthesis of alpha-ketoamides as cathepsin S inhibitors with potential applications against tumor invasion and angiogenesis. J Med Chem 53:4545-9 (2010)  
Target
Name:
Cathepsin S
Synonyms:
CATS_HUMAN Cathepsin S (Cat S) | cathepsin S preproprotein
Type:
Protein
Mol. Mass.:
37507.38
Organism:
Homo sapiens (Human)
Description:
P25774
Residue:
331
  
Inhibitor
Name:
BDBM50320065
Synonyms:
CHEMBL1085970 | Glycine, N-[(3S)-4-Benzyloxy-3-[[[((2S)-2-[(3-amino-4-chlorobenzoyl)amino]cyclohexyl-L-alanyl]carbonyl]amino]-1,2-dioxobutyl],Ethyl Ester
Type:
Small organic molecule
Emp. Form.:
C31H39ClN4O7
Mol. Mass.:
615.117
SMILES:
CCOC(=O)CNC(=O)C(=O)C(COCc1ccccc1)NC(=O)[C@H](CC1CCCCC1)NC(=O)c1ccc(Cl)c(N)c1
: