Target
Serine/threonine-protein kinase mTOR
Ligand
BDBM50320100
Substrate
Meas. Tech.
ChEMBL_635345 (CHEMBL1119658)
IC50
2.5±n/a nM
Citation
 Zhang, NAyral-Kaloustian, SAnderson, JTNguyen, TDas, SVenkatesan, AMBrooijmans, NLucas, JYu, KHollander, IMallon, R 5-ureidobenzofuranone indoles as potent and efficacious inhibitors of PI3 kinase-alpha and mTOR for the treatment of breast cancer. Bioorg Med Chem Lett 20:3526-9 (2010)  
Target
Name:
Serine/threonine-protein kinase mTOR
Synonyms:
FK506-binding protein 12-rapamycin complex-associated protein 1 FRAP FRAP1 MTOR Mammalian Target of Rapamycin (mTOR) RAFT1 Rapamycin and FKBP12 target 1 Serine/threonine-protein kinase (mTOR) | mTORC2
Type:
Rapamycin target protein
Mol. Mass.:
288917.12
Organism:
Homo sapiens (Human)
Description:
P42345
Residue:
2549
  
Inhibitor
Name:
BDBM50320100
Synonyms:
1-(2-((7-fluoro-5-methoxy-2-(1,3,5-trimethyl-1H-pyrazol-4-yl)-1H-indol-3-yl)methylene)-3-oxo-2,3-dihydrobenzofuran-5-yl)-3-(4-(morpholine-4-carbonyl)phenyl)urea | CHEMBL1082620
Type:
Small organic molecule
Emp. Form.:
C36H33FN6O6
Mol. Mass.:
664.6822
SMILES:
COc1cc(F)c2[nH]c(c(\C=C3\Oc4ccc(NC(=O)Nc5ccc(cc5)C(=O)N5CCOCC5)cc4C3=O)c2c1)-c1c(C)nn(C)c1C
: