Target
Tyrosine-protein kinase Lck
Ligand
BDBM50320205
Substrate
Meas. Tech.
ChEMBL_635427 (CHEMBL1120227)
IC50
4±n/a nM
Citation
 Gommermann, NBuehlmayer, Pvon Matt, ABreitenstein, WMasuya, KPirard, BFuret, PCowan-Jacob, SWWeckbecker, G New pyrazolo[1,5a]pyrimidines as orally active inhibitors of Lck. Bioorg Med Chem Lett 20:3628-31 (2010)  
Target
Name:
Tyrosine-protein kinase Lck
Synonyms:
2.7.10.2 LCK_HUMAN Leukocyte C-terminal Src kinase Lymphocyte-specific protein tyrosine kinase Protein YT16 Proto-oncogene tyrosine-protein kinase LCK T cell-specific protein-tyrosine kinase
Type:
Mol. Mass.:
57987.83
Organism:
Homo sapiens (Human)
Description:
P06239
Residue:
509
  
Inhibitor
Name:
BDBM50320205
Synonyms:
CHEMBL1083001 | N-(4-(7-amino-3-(4-(4-methylpiperazin-1-yl)phenyl)pyrazolo[1,5-a]pyrimidin-6-yl)phenyl)-3-cyclopentylpropanamide
Type:
Small organic molecule
Emp. Form.:
C31H37N7O
Mol. Mass.:
523.6718
SMILES:
CN1CCN(CC1)c1ccc(cc1)-c1cnn2c(N)c(cnc12)-c1ccc(NC(=O)CCC2CCCC2)cc1
: