Target
ATP-dependent 6-phosphofructokinase
Ligand
BDBM50320385
Substrate
Meas. Tech.
ChEMBL_634086 (CHEMBL1118358)
IC50
20000±n/a nM
Citation
 Ngantchou, INyasse, BDenier, CBlonski, CHannaert, VSchneider, B Antitrypanosomal alkaloids from Polyalthia suaveolens (Annonaceae): their effects on three selected glycolytic enzymes of Trypanosoma brucei. Bioorg Med Chem Lett 20:3495-8 (2010)  
Target
Name:
ATP-dependent 6-phosphofructokinase
Synonyms:
6-phospho-1-fructokinase pfk
Type:
PROTEIN
Mol. Mass.:
53537.94
Organism:
Trypanosoma brucei
Description:
ChEMBL_1288121
Residue:
487
  
Inhibitor
Name:
BDBM50320385
Synonyms:
(4aR,6aR,12bS)-4,4,6a,12b-Tetramethyl-1,4a,5,6,6a,12,12a,12b-octahydro-2H,4H-6b-aza-benzo[5,6]pentaleno[2,1-b]naphthalen-3-one | CHEMBL1082691
Type:
Small organic molecule
Emp. Form.:
C23H29NO
Mol. Mass.:
335.4825
SMILES:
C[C@@]12CC[C@H]3C(C)(C)C(=O)CC[C@]3(C)C1Cc1cc3ccccc3n21
: