Target
Beta-glucosidase A
Ligand
BDBM50320826
Substrate
Meas. Tech.
ChEMBL_639185 (CHEMBL1168038)
pH
5±n/a
IC50
152000±n/a nM
Comments
extracted
Citation
 Kato, AYamashita, YNakagawa, SKoike, YAdachi, IHollinshead, JNash, RJIkeda, KAsano, N 2,5-Dideoxy-2,5-imino-d-altritol as a new class of pharmacological chaperone for Fabry disease. Bioorg Med Chem 18:3790-4 (2010)  
Target
Name:
Beta-glucosidase A
Synonyms:
BGLS_CALSA | bglA
Type:
PROTEIN
Mol. Mass.:
53484.21
Organism:
Caldocellum saccharolyticum
Description:
ChEMBL_37437
Residue:
455
  
Inhibitor
Name:
BDBM50320826
Synonyms:
CHEMBL1163255 | beta-1-C-Butyl-1-deoxygalactonojirimycin
Type:
Small organic molecule
Emp. Form.:
C11H23NO3
Mol. Mass.:
217.3052
SMILES:
CCCC[C@@H]1N[C@H](CO)[C@H](O)[C@H](O)[C@H]1C
: