Target
Tyrosine-protein phosphatase non-receptor type 2
Ligand
BDBM50320946
Substrate
Meas. Tech.
ChEMBL_638041 (CHEMBL1166944)
IC50
970±n/a nM
Citation
 Xu, JQShen, QLi, JHu, LH Dammaranes from Gynostemma pentaphyllum and synthesis of their derivatives as inhibitors of protein tyrosine phosphatase 1B. Bioorg Med Chem 18:3934-9 (2010)  
Target
Name:
Tyrosine-protein phosphatase non-receptor type 2
Synonyms:
PTN2_HUMAN PTPT T-cell protein-tyrosine phosphatase TCPTP Tyrosine-protein phosphatase non-receptor type 2 (TC-PTP)
Type:
Protein
Mol. Mass.:
48481.80
Organism:
Homo sapiens (Human)
Description:
P17706
Residue:
415
  
Inhibitor
Name:
BDBM50320946
Synonyms:
(3S,20S,23S)-3-(4'-Carboxybenzoyloxy)-20,23-dihydroxydammar-24-en-21-oic acid-21,23-lactone | CHEMBL1163239
Type:
Small organic molecule
Emp. Form.:
C37H50O7
Mol. Mass.:
606.7887
SMILES:
[#6]\[#6](-[#6])=[#6]\[#6@@H]-1-[#6][C@]([#8])([#6@H]-2-[#6]-[#6]-[#6@@H]3-[#6@@H]-2-[#6]-[#6]-[#6@H]2[C@@]3([#6])[#6]-[#6]-[#6@H]3C([#6])([#6])[#6@H](-[#6]-[#6][C@]23[#6])-[#8]-[#6](=O)-c2ccc(cc2)-[#6](-[#8])=O)[#6](=O)-[#8]1
: