Target
3-hydroxy-3-methylglutaryl-coenzyme A reductase
Ligand
BDBM50321104
Substrate
Meas. Tech.
ChEMBL_637423 (CHEMBL1166356)
Ki
51±n/a nM
Citation
 Pak, VVKoo, MKwon, DYShakhidoyatov, KMYun, L Peptide fragmentation as an approach in modeling of an active peptide and designing a competitive inhibitory peptide for HMG-CoA reductase. Bioorg Med Chem 18:4300-9 (2010)  
Target
Name:
3-hydroxy-3-methylglutaryl-coenzyme A reductase
Synonyms:
3-hydroxy-3-methylglutaryl-coenzyme A (HMG-CoA) reductase HMDH_HUMAN HMG-CoA reductase (HMGR) | HMGCR
Type:
Enzyme
Mol. Mass.:
97477.10
Organism:
Homo sapiens (Human)
Description:
P04035
Residue:
888
  
Inhibitor
Name:
BDBM50321104
Synonyms:
CHEMBL1163804 | DFGYVAE
Type:
Small organic molecule
Emp. Form.:
C37H49N7O13
Mol. Mass.:
799.8241
SMILES:
CC(C)[C@H](NC(=O)[C@H](Cc1ccc(O)cc1)NC(=O)CNC(=O)[C@H](Cc1ccccc1)NC(=O)[C@@H](N)CC(O)=O)C(=O)N[C@@H](C)C(=O)N[C@@H](CCC(O)=O)C(O)=O
: