Target
Aldo-keto reductase family 1 member B10
Ligand
BDBM50321715
Substrate
Meas. Tech.
ChEMBL_640033 (CHEMBL1174247)
IC50
22±n/a nM
Citation
 Endo, SMatsunaga, TKuwata, KZhao, HTEl-Kabbani, OKitade, YHara, A Chromene-3-carboxamide derivatives discovered from virtual screening as potent inhibitors of the tumour maker, AKR1B10. Bioorg Med Chem 18:2485-90 (2010)  
Target
Name:
Aldo-keto reductase family 1 member B10
Synonyms:
AK1BA_HUMAN AKR1B11 ARP Aldo-keto reductase family 1 member B10 (AKR1B10) Aldose reductase-like SI reductase hARP
Type:
Protein
Mol. Mass.:
36024.67
Organism:
Homo sapiens (Human)
Description:
O60218. 1ZUA; 4JII; 4GQ0
Residue:
316
  
Inhibitor
Name:
BDBM50321715
Synonyms:
2-(2,5-dimethoxyphenylimino)-7-hydroxy-N-(pyridin-2-yl)-2H-chromene-3-carboxamide | CHEMBL1169756
Type:
Small organic molecule
Emp. Form.:
C23H19N3O5
Mol. Mass.:
417.4141
SMILES:
COc1ccc(OC)c(c1)\N=c1/oc2cc(O)ccc2cc1C(=O)Nc1ccccn1
: