Target
Poly [ADP-ribose] polymerase 1
Ligand
BDBM27088
Substrate
Meas. Tech.
ChEMBL_642955 (CHEMBL1176193)
IC50
240±n/a nM
Citation
 Ferraris, DV Evolution of poly(ADP-ribose) polymerase-1 (PARP-1) inhibitors. From concept to clinic. J Med Chem 53:4561-84 (2010)  
Target
Name:
Poly [ADP-ribose] polymerase 1
Synonyms:
(ARTD1 or PARP1) 2.4.2.30 ADPRT ARTD1 Human diphtheria toxin-like ADP-ribosyltransferase (ARTD1 or PARP1) NT-PARP-1 PARP1 PPOL Poly [ADP-ribose] polymerase 1 (PARP) Poly [ADP-ribose] polymerase 1 (PARP1) Poly [ADP-ribose] polymerase 1, 28-kDa form Poly [ADP-ribose] polymerase 1, processed C-terminus Poly [ADP-ribose] polymerase-1 Poly(ADP-ribose) polymerase-1 (ARTD1/PARP1) Protein poly-ADP-ribosyltransferase PARP1 | Synonyms=ADPRT
Type:
Mol. Mass.:
113114.22
Organism:
Homo sapiens (Human)
Description:
P09874
Residue:
1014
  
Inhibitor
Name:
BDBM27088
Synonyms:
1H-1,3-benzodiazole-4-carboxamide CHEMBL133694
Type:
Small organic molecule
Emp. Form.:
C8H7N3O
Mol. Mass.:
161.1607
SMILES:
NC(=O)c1cccc2nc[nH]c12
: