Target
RAC-alpha serine/threonine-protein kinase
Ligand
BDBM50322384
Substrate
Meas. Tech.
ChEMBL_643086 (CHEMBL1176552)
IC50
600±n/a nM
Citation
 Freeman-Cook, KDAutry, CBorzillo, GGordon, DBarbacci-Tobin, EBernardo, VBriere, DClark, TCorbett, MJakubczak, JKakar, SKnauth, ELippa, BLuzzio, MJMansour, MMartinelli, GMarx, MNelson, KPandit, JRajamohan, FRobinson, SSubramanyam, CWei, LWythes, MMorris, J Design of selective, ATP-competitive inhibitors of Akt. J Med Chem 53:4615-22 (2010)  
Target
Name:
RAC-alpha serine/threonine-protein kinase
Synonyms:
AKT phosphorylation (p-AKT) AKT1/PPP1CA C-AKT PKB alpha Protein kinase B Protein kinase B (Akt 1) Protein kinase B alpha Proto-oncogene Akt (Akt1) Proto-oncogene c-Akt (AKT1) RAC-PK-alpha RAC-alpha serine/threonine-protein kinase (AKT1) | RAC-alpha serine/threonine-protein kinase (pAKT)
Type:
Enzyme
Mol. Mass.:
55681.25
Organism:
Homo sapiens (Human)
Description:
P31749
Residue:
480
  
Inhibitor
Name:
BDBM50322384
Synonyms:
(R)-N-(1-(5-methyl-7H-pyrrolo[2,3-d]pyrimidin-4-yl)pyrrolidin-3-yl)benzenesulfonamide | CHEMBL1173697
Type:
Small organic molecule
Emp. Form.:
C17H19N5O2S
Mol. Mass.:
357.43
SMILES:
Cc1c[nH]c2ncnc(N3CC[C@H](C3)NS(=O)(=O)c3ccccc3)c12
: