Target
RAC-alpha serine/threonine-protein kinase
Ligand
BDBM50322404
Substrate
Meas. Tech.
ChEMBL_643086 (CHEMBL1176552)
IC50
7.8±n/a nM
Citation
 Freeman-Cook, KDAutry, CBorzillo, GGordon, DBarbacci-Tobin, EBernardo, VBriere, DClark, TCorbett, MJakubczak, JKakar, SKnauth, ELippa, BLuzzio, MJMansour, MMartinelli, GMarx, MNelson, KPandit, JRajamohan, FRobinson, SSubramanyam, CWei, LWythes, MMorris, J Design of selective, ATP-competitive inhibitors of Akt. J Med Chem 53:4615-22 (2010)  
Target
Name:
RAC-alpha serine/threonine-protein kinase
Synonyms:
AKT phosphorylation (p-AKT) AKT1/PPP1CA C-AKT PKB alpha Protein kinase B Protein kinase B (Akt 1) Protein kinase B alpha Proto-oncogene Akt (Akt1) Proto-oncogene c-Akt (AKT1) RAC-PK-alpha RAC-alpha serine/threonine-protein kinase (AKT1) | RAC-alpha serine/threonine-protein kinase (pAKT)
Type:
Enzyme
Mol. Mass.:
55681.25
Organism:
Homo sapiens (Human)
Description:
P31749
Residue:
480
  
Inhibitor
Name:
BDBM50322404
Synonyms:
(S)-N-((3-amino-1-(5-cyano-7H-pyrrolo[2,3-d]pyrimidin-4-yl)pyrrolidin-3-yl)methyl)-4-fluorobenzamide | CHEMBL1171993
Type:
Small organic molecule
Emp. Form.:
C19H18FN7O
Mol. Mass.:
379.3909
SMILES:
N[C@]1(CNC(=O)c2ccc(F)cc2)CCN(C1)c1ncnc2[nH]cc(C#N)c12
: