Target
Tyrosine-protein kinase ABL1
Ligand
BDBM50322533
Substrate
Meas. Tech.
ChEMBL_641693 (CHEMBL1176860)
IC50
1.6±n/a nM
Citation
 Huang, WSMetcalf, CASundaramoorthi, RWang, YZou, DThomas, RMZhu, XCai, LWen, DLiu, SRomero, JQi, JChen, IBanda, GLentini, SPDas, SXu, QKeats, JWang, FWardwell, SNing, YSnodgrass, JTBroudy, MIRussian, KZhou, TCommodore, LNarasimhan, NIMohemmad, QKIuliucci, JRivera, VMDalgarno, DCSawyer, TKClackson, TShakespeare, WC Discovery of 3-[2-(imidazo[1,2-b]pyridazin-3-yl)ethynyl]-4-methyl-N-{4-[(4-methylpiperazin-1-yl)methyl]-3-(trifluoromethyl)phenyl}benzamide (AP24534), a potent, orally active pan-inhibitor of breakpoint cluster region-abelson (BCR-ABL) kinase including the T315I gatekeeper mutant. J Med Chem 53:4701-19 (2010)  
Target
Name:
Tyrosine-protein kinase ABL1
Synonyms:
ABL ABL1_HUMAN JTK7 Proto-oncogene tyrosine-protein kinase ABL1 Tyrosine-protein kinase ABL V-abl Abelson murine leukemia viral oncogene homolog 1 p150 | tyrosine-protein kinase ABL1 isoform a
Type:
Enzyme
Mol. Mass.:
122897.30
Organism:
Homo sapiens (Human)
Description:
P00519
Residue:
1130
  
Inhibitor
Name:
BDBM50322533
Synonyms:
3-(2-(6-amino-9H-purin-9-yl)vinyl)-4-methyl-N-(3-(4-methyl-1H-imidazol-1-yl)-5-(trifluoromethyl)phenyl)benzamide | CHEMBL1171679
Type:
Small organic molecule
Emp. Form.:
C26H21F3N8O
Mol. Mass.:
518.4931
SMILES:
Cc1cn(cn1)-c1cc(NC(=O)c2ccc(C)c(\C=C\n3cnc4c(N)ncnc34)c2)cc(c1)C(F)(F)F
: