Target
Tyrosine-protein kinase ABL1
Ligand
BDBM50322535
Substrate
Meas. Tech.
ChEMBL_641699 (CHEMBL1176866)
IC50
0.37±n/a nM
Citation
 Huang, WSMetcalf, CASundaramoorthi, RWang, YZou, DThomas, RMZhu, XCai, LWen, DLiu, SRomero, JQi, JChen, IBanda, GLentini, SPDas, SXu, QKeats, JWang, FWardwell, SNing, YSnodgrass, JTBroudy, MIRussian, KZhou, TCommodore, LNarasimhan, NIMohemmad, QKIuliucci, JRivera, VMDalgarno, DCSawyer, TKClackson, TShakespeare, WC Discovery of 3-[2-(imidazo[1,2-b]pyridazin-3-yl)ethynyl]-4-methyl-N-{4-[(4-methylpiperazin-1-yl)methyl]-3-(trifluoromethyl)phenyl}benzamide (AP24534), a potent, orally active pan-inhibitor of breakpoint cluster region-abelson (BCR-ABL) kinase including the T315I gatekeeper mutant. J Med Chem 53:4701-19 (2010)  
Target
Name:
Tyrosine-protein kinase ABL1
Synonyms:
ABL ABL1_HUMAN JTK7 Proto-oncogene tyrosine-protein kinase ABL1 Tyrosine-protein kinase ABL V-abl Abelson murine leukemia viral oncogene homolog 1 p150 | tyrosine-protein kinase ABL1 isoform a
Type:
Enzyme
Mol. Mass.:
122897.30
Organism:
Homo sapiens (Human)
Description:
P00519
Residue:
1130
  
Inhibitor
Name:
BDBM50322535
Synonyms:
3-(imidazo[1,2-b]pyridazin-3-ylethynyl)-4-methyl-N-{4-[(4-methylpiperazin-1-yl)methyl]-3-(trifluoromethyl)phenyl}benzamide CHEMBL1171837 US10464902, Ponatinib | US9255107, AP24534
Type:
Small organic molecule
Emp. Form.:
C29H27F3N6O
Mol. Mass.:
532.5595
SMILES:
CN1CCN(Cc2ccc(NC(=O)c3ccc(C)c(c3)C#Cc3cnc4cccnn34)cc2C(F)(F)F)CC1
: