Target
Metallo-beta-lactamase L1 type 3
Ligand
BDBM50322608
Substrate
Meas. Tech.
ChEMBL_641774 (CHEMBL1177097)
Ki
>40000±n/a nM
Citation
 Lassaux, PHamel, MGulea, MDelbrück, HMercuri, PSHorsfall, LDehareng, DKupper, MFrère, JMHoffmann, KGalleni, MBebrone, C Mercaptophosphonate compounds as broad-spectrum inhibitors of the metallo-beta-lactamases. J Med Chem 53:4862-76 (2010)  
Target
Name:
Metallo-beta-lactamase L1 type 3
Synonyms:
BLA1_STEMA | Beta-lactamase L1
Type:
PROTEIN
Mol. Mass.:
30803.13
Organism:
Stenotrophomonas maltophilia
Description:
ChEMBL_1500319
Residue:
290
  
Inhibitor
Name:
BDBM50322608
Synonyms:
CHEMBL1172388 | alpha-Sulfanylpropylphosphonic acid
Type:
Small organic molecule
Emp. Form.:
C3H9O3PS
Mol. Mass.:
156.141
SMILES:
CCC(=S)P(O)(O)O
: