Target
Metallo-beta-lactamase type 2
Ligand
BDBM50322605
Substrate
Meas. Tech.
ChEMBL_641771 (CHEMBL1177094)
Ki
2000±n/a nM
Citation
 Lassaux, PHamel, MGulea, MDelbrück, HMercuri, PSHorsfall, LDehareng, DKupper, MFrère, JMHoffmann, KGalleni, MBebrone, C Mercaptophosphonate compounds as broad-spectrum inhibitors of the metallo-beta-lactamases. J Med Chem 53:4862-76 (2010)  
Target
Name:
Metallo-beta-lactamase type 2
Synonyms:
BLAB_AERHY cphA
Type:
PROTEIN
Mol. Mass.:
28022.56
Organism:
Aeromonas hydrophila
Description:
ChEMBL_641771
Residue:
254
  
Inhibitor
Name:
BDBM50322605
Synonyms:
CHEMBL1173337 bis(1-methylethyl) [2-(sulfanylmethyl)phenyl]phosphonate
Type:
Small organic molecule
Emp. Form.:
C13H21O3PS
Mol. Mass.:
288.343
SMILES:
CC(C)OP(=O)(OC(C)C)c1ccccc1CS
: