Target
Metallo-beta-lactamase type 2
Ligand
BDBM50322612
Substrate
Meas. Tech.
ChEMBL_641771 (CHEMBL1177094)
Ki
5000±n/a nM
Citation
 Lassaux, PHamel, MGulea, MDelbrück, HMercuri, PSHorsfall, LDehareng, DKupper, MFrère, JMHoffmann, KGalleni, MBebrone, C Mercaptophosphonate compounds as broad-spectrum inhibitors of the metallo-beta-lactamases. J Med Chem 53:4862-76 (2010)  
Target
Name:
Metallo-beta-lactamase type 2
Synonyms:
BLAB_AERHY cphA
Type:
PROTEIN
Mol. Mass.:
28022.56
Organism:
Aeromonas hydrophila
Description:
ChEMBL_641771
Residue:
254
  
Inhibitor
Name:
BDBM50322612
Synonyms:
CHEMBL1173797 | alpha-Sulfanyl(2,4-dichlorobenzyl)phosphonic acid
Type:
Small organic molecule
Emp. Form.:
C7H7Cl2O3PS
Mol. Mass.:
273.073
SMILES:
OP(O)(O)C(=S)c1ccc(Cl)cc1Cl
: